id,wave,calweek,firstwave,gender,agegr,lregion,urbrural,edugr,hhincomegr,livalone,migration,ncd,psychdiag,child,working,unemployed,workpop,selfempl,branchegr,homeofficegr,rooms,persroom,persroom_cat,wb2_good,wb2_bad,ms1_often,ms2_ind_medhigh,ms2_ind_high,ms3_anx_red,ms3_depr_red,ph1_good,ph2_ind_strong,ph2_1_yes,ph2_2_yes,ph2_3_yes,ph2_4_yes,ph2_5_yes,ph2_6_yes,ph2_7_yes,ph2_8_yes,ph2_9_yes,ph2_10_yes,ph2_11_yes,ph2_12_yes,ss3_often,hb3_11_yes,eh1_friends,eh1_neighbours,eh1_relatives,eh1_total_zero,eh1_friends_65plus,eh1_neighbours_65plus,eh1_relatives_65plus,eh1_total_zero_65plus,ss2_happy,ss2_unhappy,ss1_satisfied,ss1_dissatisfied,hb7_insufficient,hb7_none,hb3_6_yes,hb9_2_yes,hb10_daily,bag1_2_freq,bag1_3_freq,bag3_1_freq,hb8_2_mostly,hb8_3_mostly,hb8_4_mostly,hb8_5_mostly,hb8_7_mostly,hb8_8_mostly,hb8_9_mostly,hs1_1_anyuse,hs1_2_7d,hs1_3_7d,hs1_4_7d,hs1_5_7d,hs1_6_7d,hs1_7_7d,hs1_8_7d,hs1_9_7d,hs1_10_7d,hs1_11_7d,hs2_1_anynonuse,hs2_2_7d,hs2_3_7d,hs2_4_7d,hs2_5_7d,hs2_6_7d,hs2_7_7d,hs2_8_7d,hs2_9_7d,hs2_10_7d,hs2_11_7d,hs1_use_total,hs2_nonuse_total,wc2_always,wtlost_pandemic,wtlost_illness,plost_pandemic,plost_illness,wc1_rather,lc3_satisfied,lc3_dissatisfied,lc4_difficult,lc1_worried,lc2_worried,st1_high,st3_high,st2_high,mu3_2_high,mu3_7_high,mu3_9_high,va1,va4,va5,va6,va7_1,va7_2,va7_3,va7_4,va7_5,va7_6,va7_7,va8,app1,app2,app3a,app3b_1,app3b_2,app3b_5,app3b_3,app3b_4,app3b_6,app4,hc1_1,hc1_2,hc2,hc4_1,hc4_2,hc4_3,hc4_4,hc4_5,hc4_6,hc5_1,hc5_2,hc5_3,hc5_4,hc5_5,mu3_1,mu3_2,mu3_3,mu3_4,mu3_5,mu3_6,mu3_7,mu3_8,mu3_9,mu1_1,mu1_2,mu1_3,mu1_4,mu1_5,mu1_6,calib_weight
10001,1,1,1,2,3,2,1,3,3,2,1,2,1,2,1,0,2,1,6,2,4,2,3,1,0,1,1,0,,,1,1,1,0,1,1,1,0,0,0,0,1,0,0,0,.h,.h,.h,,,.k,.k,.k,.k,1,0,1,0,1,0,1,.h,.h,.h,.h,.h,.h,.h,.h,.h,.h,.h,.h,0,0,0,0,0,0,0,0,0,,,0,0,0,0,0,0,0,0,0,,,0,0,1,0,0,.2,,0,.h,.h,.h,.h,.h,.h,.h,.h,.h,.h,.h,.h,.h,.h,.h,.h,.h,.h,.h,.h,.h,.h,.h,.h,.h,.h,.h,.h,.h,.h,.h,.h,.h,.h,.h,.h,.h,.h,.h,.h,.h,.h,.h,.h,.h,.h,.h,.h,.h,.h,.h,.h,.h,.h,.h,.h,.h,.h,.h,.h,.h,.h,3629
10001,2,2,1,2,3,2,1,3,3,2,1,2,1,2,1,0,2,1,6,2,4,2,3,1,0,0,0,0,,,1,0,1,0,1,0,1,0,0,0,0,1,0,0,0,0,.d,.d,,,.k,.k,.k,.k,1,0,1,0,0,0,1,.h,.h,.h,.h,.h,1,0,1,1,1,1,.h,0,0,0,0,0,0,0,0,0,0,0,0,0,0,0,0,0,0,0,0,0,0,0,0,1,0,0,.1,,0,.h,.h,.h,.h,.h,.h,.h,.h,.h,.h,.h,.h,.h,.h,.h,.h,.h,.h,.h,.h,.h,.h,.h,.h,.h,.h,.h,.h,.h,.h,.h,.h,.h,.h,.h,.h,.h,.h,.h,.h,.h,.h,.h,.h,.h,.h,.h,.h,.h,.h,.h,.h,.h,.h,.h,.h,.h,.h,.h,.h,.h,.h,5062
10001,4,4,1,2,3,2,1,3,3,2,1,2,1,2,1,0,2,1,6,2,4,2,3,1,0,0,0,0,,,1,1,1,1,1,1,1,0,0,0,0,1,0,0,0,0,.d,.d,,,.k,.k,.k,.k,1,0,1,0,1,0,1,.h,.h,.h,.h,.h,1,1,1,1,1,1,1,1,0,0,0,0,0,0,0,0,1,0,0,0,0,0,0,0,0,0,0,0,0,100,0,1,0,0,.1,0,0,.h,.h,.h,.h,.h,.h,.h,.h,.e,.e,.e,.h,.h,.h,.h,.h,.h,.h,.h,.h,.h,.h,.h,.h,.h,.h,.h,.h,.h,.h,.h,.h,.h,.h,.h,.h,.h,.h,.h,.h,.h,.h,.h,.h,.h,.h,.h,.e,.e,.e,.e,.e,.e,.e,.e,.e,.e,.e,.e,.e,.e,.e,4264
10001,5,5,1,2,3,2,1,3,3,2,1,2,1,2,1,0,2,1,6,2,4,2,3,1,0,0,0,0,,,1,0,1,0,1,0,1,0,0,0,0,1,0,0,0,0,.d,.d,,,.k,.k,.k,.k,1,0,1,0,1,0,0,.h,.h,.h,.h,.h,1,1,1,1,1,1,1,0,0,0,0,0,0,0,0,0,0,0,0,0,0,0,0,0,0,0,0,0,0,0,0,1,0,0,.1,0,0,.h,.h,.h,.h,.h,.h,.h,.h,.h,.h,.h,.h,.h,.h,.h,.h,.h,.h,.h,.h,.h,.h,.h,.h,.h,.h,.h,.h,.h,.h,.h,.h,.h,.h,.h,.h,.h,.h,.h,.h,.h,.h,.h,.h,.h,.h,.h,.h,.h,.h,.h,.h,.h,.h,.h,.h,.h,.h,.h,.h,.h,.h,4645
10001,6,6,1,2,3,2,1,3,3,2,1,2,1,2,1,0,2,1,6,2,4,2,3,1,0,0,0,0,,,1,0,0,0,0,0,0,0,0,0,0,1,0,0,0,0,.d,.d,,,.k,.k,.k,.k,1,0,1,0,1,0,0,.h,.h,1,0,0,1,0,1,1,1,1,1,0,0,0,0,0,0,0,0,0,0,0,0,0,0,0,0,0,0,0,0,0,0,0,0,1,.h,.h,.h,.h,0,.h,.h,.h,.h,.h,.h,.h,.h,.e,.e,.e,.h,.h,.h,.h,.h,.h,.h,.h,.h,.h,.h,.h,.h,.h,.h,.h,.h,.h,.h,.h,.h,.h,.h,.h,.h,.h,.h,.h,.h,.h,.h,.h,.h,.h,.h,.h,.e,.e,.e,.e,.e,.e,.e,.e,.e,.e,.e,.e,.e,.e,.e,4899
10001,7,7,1,2,3,2,1,3,3,2,1,2,1,2,1,0,2,1,6,1,4,2,3,1,0,0,0,0,,,1,0,1,0,1,0,0,0,0,0,0,1,0,0,0,0,.d,.d,,,.k,.k,.k,.k,1,0,1,0,1,0,0,.h,.h,0,0,0,1,0,1,1,1,0,1,1,0,0,0,0,0,0,0,0,0,1,0,0,0,0,0,0,0,0,0,0,0,100,0,0,0,0,.5,0,0,.h,.h,.h,.h,.h,.h,.h,.h,.h,.h,.h,.h,.h,.h,.h,.h,.h,.h,.h,.h,.h,.h,.h,.h,.h,.h,.h,.h,.h,.h,.h,.h,.h,.h,.h,.h,.h,.h,.h,.h,.h,.h,.h,.h,.h,.h,.h,.h,.h,.h,.h,.h,.h,.h,.h,.h,.h,.h,.h,.h,.h,.h,5422
10001,8,8,1,2,3,2,1,3,3,2,1,2,1,2,1,0,2,1,6,2,4,2,3,1,0,0,0,0,,,1,1,1,0,1,0,1,1,0,0,0,1,0,0,0,0,.d,.d,,,.k,.k,.k,.k,1,0,1,0,1,0,1,.h,.h,0,0,0,1,1,1,1,1,0,1,0,0,0,0,0,0,0,0,0,0,0,0,0,0,0,0,0,0,0,0,0,0,0,0,1,0,0,0,0,0,.h,.h,.h,.h,.h,.h,.h,.h,.e,.e,.e,.h,.h,.h,.h,.h,.h,.h,.h,.h,.h,.h,.h,4,4,.c,.h,.h,.h,.h,.h,.h,.h,.h,.h,.h,.h,.h,.h,.h,.h,.h,.h,.h,.h,.h,.h,.e,.e,.e,.e,.e,.e,.e,.e,.e,.e,.e,.e,.e,.e,.e,5258
10001,9,9,1,2,3,2,1,3,3,2,1,2,1,2,1,0,2,1,6,2,4,2,3,1,0,0,0,0,,,1,0,1,0,0,0,0,0,0,0,0,1,0,0,0,0,.d,.d,,,.k,.k,.k,.k,1,0,1,0,1,0,1,.h,.h,0,0,0,1,1,1,1,1,1,1,0,0,0,0,0,0,0,0,0,0,0,0,0,0,0,0,0,0,0,0,0,0,0,0,0,0,0,0,0,0,.h,.h,.h,.h,.h,0,0,0,.h,.h,.h,.h,.h,.h,.h,.h,.h,.h,.h,.h,.h,.h,.h,4,4,.c,.h,.h,.h,.h,.h,.h,.h,.h,.h,.h,.h,.h,.h,.h,.h,.h,.h,.h,.h,.h,.h,.h,.h,.h,.h,.h,.h,.h,.h,.h,.h,.h,.h,.h,.h,.h,5327
10001,10,10,1,2,3,2,1,3,3,2,1,2,1,2,1,0,2,1,6,1,4,2,3,1,0,0,0,0,,,1,0,1,0,1,0,1,0,0,0,0,0,0,0,0,0,.d,.d,,,.k,.k,.k,.k,1,0,1,0,1,0,1,.h,.h,0,0,0,1,1,1,1,1,1,1,0,0,0,0,0,0,0,0,0,0,0,0,0,0,0,0,0,0,0,0,0,0,0,0,0,0,0,.60000002,.1,0,.h,.h,.h,.h,.h,.h,.h,.h,.e,.e,.e,.h,.h,.h,.h,.h,.h,.h,.h,.h,.h,.h,.h,4,4,.c,.h,.h,.h,.h,.h,.h,.h,2,.c,2,.c,.c,.c,.c,.c,.c,.c,.c,.c,.c,.c,.e,.e,.e,.e,.e,.e,.e,.e,.e,.e,.e,.e,.e,.e,.e,5375
10001,11,11,1,2,3,2,1,3,3,2,1,2,1,2,1,0,2,1,6,1,4,2,3,1,0,0,0,0,,,1,0,0,1,1,0,1,0,0,0,0,0,1,0,0,0,0,0,0,1,.k,.k,.k,.k,1,0,1,0,1,0,0,0,0,.h,.h,0,1,1,1,1,1,1,1,0,0,0,0,0,0,0,0,0,0,0,0,0,0,0,0,0,0,0,0,0,0,0,0,0,0,0,.60000002,.40000001,0,1,0,0,0,0,0,0,0,1,1,0,.h,.h,.h,.h,.h,.h,.h,.h,.h,.h,.h,.h,4,4,.c,.h,.h,.h,.h,.h,.h,.h,2,.c,2,.c,.c,.c,.c,.c,.c,.c,.c,.c,.c,.c,4,4,4,4,4,2,5,4,3,1,3,3,3,3,1,5135
10001,12,12,1,2,3,2,1,3,3,2,1,2,1,2,1,0,2,1,6,1,4,2,3,1,0,0,0,0,0,0,1,0,1,0,1,0,1,0,0,0,0,1,0,0,0,0,0,0,0,1,.k,.k,.k,.k,1,0,1,0,1,0,0,0,0,0,0,0,1,1,1,1,1,1,1,0,0,0,0,0,0,0,0,0,0,0,0,0,0,0,0,0,0,0,0,0,0,0,0,0,0,0,.69999999,.2,0,.h,.h,.h,0,0,.h,.h,.h,1,1,0,.h,.h,.h,.h,.h,.h,.h,.h,.h,.h,.h,.h,4,4,.h,.c,.c,.c,.c,.c,.h,.h,2,.c,2,.c,.c,.c,.c,.c,.c,.c,.c,.c,.c,.c,3,4,4,4,3,1,5,.h,3,.h,.h,.h,.h,.h,.h,2749
10001,13,13,1,2,3,2,1,3,3,2,1,2,1,2,1,0,2,1,6,1,4,2,3,1,0,0,0,0,0,0,1,1,1,1,1,0,1,1,0,0,0,1,0,0,0,0,0,0,0,1,.k,.k,.k,.k,1,0,1,0,1,0,0,0,0,0,0,0,1,1,1,1,1,1,1,0,0,0,0,0,0,0,0,0,0,0,0,0,0,0,0,0,0,0,0,0,0,0,0,0,0,0,.2,.2,0,1,0,0,0,0,0,0,0,.h,.h,.h,.h,.h,.h,.h,.h,.h,.h,.h,.h,.h,.h,.h,4,4,.h,.c,.c,.c,.c,.c,.h,.h,2,.c,2,.c,.c,.c,.c,.c,.c,.c,.c,.c,.c,.c,.h,.h,.h,.h,.h,.h,.h,.h,.h,.h,.h,.h,.h,.h,.h,3253
10001,14,14,1,2,3,2,1,3,3,2,1,2,1,2,1,0,2,1,6,1,4,2,3,1,0,0,0,0,0,0,1,,0,0,0,0,1,1,0,0,1,0,1,1,0,0,0,0,2,0,.k,.k,.k,.k,1,0,1,0,1,0,0,0,0,0,0,0,1,1,1,1,1,1,1,1,0,1,0,0,0,0,0,0,0,0,0,0,0,0,0,0,0,0,0,0,0,100,0,0,0,0,.5,0,0,.h,.h,.h,0,0,.h,.h,.h,1,1,0,.h,.h,.h,.h,.h,.h,.h,.h,.h,.h,.h,.h,4,4,.h,.c,.c,.c,.c,.c,.h,.h,2,.c,2,.c,.c,.c,.c,.c,.c,.c,.c,.c,.c,.c,4,4,4,4,3,2,4,.h,3,.h,.h,.h,.h,.h,.h,3531
10001,15,15,1,2,3,2,1,3,3,2,1,2,1,2,1,0,2,1,6,1,4,2,3,1,0,0,0,0,0,0,1,1,1,1,1,0,1,0,0,0,0,0,0,0,0,0,1,0,1,0,.k,.k,.k,.k,1,0,1,0,0,0,0,0,0,0,0,0,1,1,1,1,1,1,1,0,0,0,0,0,0,0,0,0,0,0,0,0,0,0,0,0,0,0,0,0,0,0,0,0,0,0,.69999999,.40000001,0,1,0,0,0,0,0,0,0,.h,.h,.h,.h,.h,.h,.h,.h,.h,.h,.h,.h,.h,.h,.h,4,4,.h,.c,.c,.c,.c,.c,.h,.h,2,.c,2,.c,.c,.c,.c,.c,.c,.c,.c,.c,.c,.c,.h,.h,.h,.h,.h,.h,.h,.h,.h,.h,.h,.h,.h,.h,.h,4073
10001,16,16,1,2,3,2,1,3,3,2,1,2,1,2,1,0,2,1,6,1,4,2,3,1,0,0,0,0,0,0,1,0,0,1,0,0,0,0,0,0,0,1,0,0,0,0,0,0,0,1,.k,.k,.k,.k,1,0,1,0,1,0,0,0,0,0,0,0,1,1,1,1,1,1,1,0,0,0,0,0,0,0,0,0,0,0,0,0,0,0,0,0,0,0,0,0,0,0,0,0,0,0,.30000001,.2,0,.h,.h,.h,0,0,.h,.h,.h,1,1,1,.h,.h,.h,.h,.h,.h,.h,.h,.h,.h,.h,.h,4,4,.h,.c,.c,.c,.c,.c,.h,.h,2,.c,2,.c,.c,.c,.c,.c,.c,.c,.c,.c,.c,.c,4,4,4,4,2,1,5,.h,4,.h,.h,.h,.h,.h,.h,4173
10001,17,17,1,2,3,2,1,3,3,2,1,2,1,2,1,0,2,1,6,1,4,2,3,1,0,0,0,0,0,0,1,0,1,0,1,0,1,0,0,0,0,1,1,1,0,0,0,0,0,1,.k,.k,.k,.k,1,0,1,0,1,0,1,0,0,0,0,0,1,1,1,1,1,1,1,0,0,0,0,0,0,0,0,0,0,0,0,0,0,0,0,0,0,0,0,0,0,0,0,0,0,0,.2,.2,0,1,0,0,0,0,0,0,0,.h,.h,.h,2,.c,1,.d,.d,.d,.d,.d,.d,.d,.d,.d,4,4,.h,.c,.c,.c,.c,.c,.h,.h,2,.c,2,.c,.c,.c,.c,.c,.c,.c,.c,.c,.c,.c,.h,.h,.h,.h,.h,.h,.h,.h,.h,.h,.h,.h,.h,.h,.h,4480
10001,18,18,1,2,3,2,1,3,3,2,1,2,1,2,1,0,2,1,6,1,4,2,3,1,0,0,0,0,0,0,1,0,0,0,0,0,1,0,0,0,0,1,0,0,0,0,0,0,1,0,.k,.k,.k,.k,1,0,1,0,1,0,1,0,0,0,0,0,1,1,1,0,1,1,1,0,0,0,0,0,0,0,0,0,0,0,0,0,0,0,0,0,0,0,0,0,0,0,0,0,0,0,.1,.1,0,.h,.h,.h,0,0,.h,.h,.h,1,1,1,1,2,.c,.c,.c,.c,.c,.c,.c,.c,.c,.c,4,4,.h,.c,.c,.c,.c,.c,.c,.c,2,.c,2,.c,.c,.c,.c,.c,.c,.c,.c,.c,.c,.c,4,4,4,4,3,3,5,.h,4,.h,.h,.h,.h,.h,.h,4844
10001,19,19,1,2,3,2,1,3,3,2,1,2,1,2,1,0,2,1,6,1,4,2,3,1,0,0,0,0,0,0,1,0,1,0,0,1,0,0,0,0,0,0,0,0,0,0,1,0,2,0,.k,.k,.k,.k,1,0,1,0,1,0,1,0,0,0,0,0,1,1,1,1,1,1,1,0,0,0,0,0,0,0,0,0,0,0,0,0,0,0,0,0,0,0,0,0,0,0,0,0,0,0,.30000001,.1,0,1,0,0,0,0,0,0,0,.h,.h,.h,.g,.g,.g,.g,.g,.g,.g,.g,.g,.g,.g,.g,4,4,.h,.c,.c,.c,.c,.c,.c,.c,2,.c,2,.c,.c,.c,.c,.c,.c,.c,.c,.c,.c,.c,.h,.h,.h,.h,.h,.h,.h,.h,.h,.h,.h,.h,.h,.h,.h,4571
10002,1,1,1,2,1,1,1,3,2,2,1,1,1,1,1,0,2,1,4,2,5,1,2,1,0,1,0,0,,,1,0,1,0,0,0,0,0,0,0,0,0,0,0,0,.h,.h,.h,,,.k,.k,.k,.k,1,0,1,0,0,0,1,.h,.h,.h,.h,.h,.h,.h,.h,.h,.h,.h,.h,0,0,0,0,0,0,0,0,0,,,0,0,0,0,0,0,0,0,0,,,0,0,1,0,0,.1,,0,.h,.h,.h,.h,.h,.h,.h,.h,.h,.h,.h,.h,.h,.h,.h,.h,.h,.h,.h,.h,.h,.h,.h,.h,.h,.h,.h,.h,.h,.h,.h,.h,.h,.h,.h,.h,.h,.h,.h,.h,.h,.h,.h,.h,.h,.h,.h,.h,.h,.h,.h,.h,.h,.h,.h,.h,.h,.h,.h,.h,.h,.h,3614
10002,3,3,1,2,1,1,1,3,2,2,1,1,1,1,1,0,2,1,4,2,5,1,2,1,0,0,0,0,,,1,0,1,0,0,0,0,1,0,0,0,0,0,0,0,0,.d,.d,,,.k,.k,.k,.k,1,0,1,0,0,0,0,.h,.h,.h,.h,.h,1,0,1,1,1,1,.h,0,0,0,0,0,0,0,0,0,0,0,0,0,0,0,0,0,0,0,0,0,0,0,0,1,.h,.h,.h,,0,.h,.h,.h,.h,.h,.h,.h,.h,.h,.h,.h,.h,.h,.h,.h,.h,.h,.h,.h,.h,.h,.h,.h,.h,.h,.h,.h,.h,.h,.h,.h,.h,.h,.h,.h,.h,.h,.h,.h,.h,.h,.h,.h,.h,.h,.h,.h,.h,.h,.h,.h,.h,.h,.h,.h,.h,.h,.h,.h,.h,.h,.h,4760
10002,6,6,1,2,1,1,1,3,2,2,1,1,1,1,1,0,2,1,4,2,5,1,2,1,0,1,0,0,,,1,0,1,1,0,0,0,1,0,0,0,1,0,0,0,0,.d,.d,,,.k,.k,.k,.k,1,0,1,0,1,0,1,.h,.h,0,0,0,1,0,0,0,0,0,1,0,0,0,0,0,0,0,0,0,0,0,0,0,0,0,0,0,0,0,0,0,0,0,0,0,.h,.h,.h,.h,0,.h,.h,.h,.h,.h,.h,.h,.h,.e,.e,.e,.h,.h,.h,.h,.h,.h,.h,.h,.h,.h,.h,.h,.h,.h,.h,.h,.h,.h,.h,.h,.h,.h,.h,.h,.h,.h,.h,.h,.h,.h,.h,.h,.h,.h,.h,.h,.e,.e,.e,.e,.e,.e,.e,.e,.e,.e,.e,.e,.e,.e,.e,4662
10002,7,7,1,2,1,1,1,3,2,2,1,1,1,1,1,0,2,1,4,2,5,1,2,1,0,1,0,0,,,1,0,0,1,0,0,0,1,0,1,0,1,1,0,0,0,.d,.d,,,.k,.k,.k,.k,1,0,1,0,1,0,0,.h,.h,0,0,0,1,0,0,0,0,0,1,0,0,0,0,0,0,0,0,0,0,0,0,0,0,0,0,0,0,0,0,0,0,0,0,0,0,0,0,0,0,.h,.h,.h,.h,.h,.h,.h,.h,.h,.h,.h,.h,.h,.h,.h,.h,.h,.h,.h,.h,.h,.h,.h,.h,.h,.h,.h,.h,.h,.h,.h,.h,.h,.h,.h,.h,.h,.h,.h,.h,.h,.h,.h,.h,.h,.h,.h,.h,.h,.h,.h,.h,.h,.h,.h,.h,.h,.h,.h,.h,.h,.h,5009
10002,9,9,1,2,1,1,1,3,2,2,1,1,1,1,1,0,2,1,4,2,5,1.6666666,2,1,0,0,0,0,,,1,0,1,1,0,0,0,1,0,0,0,1,0,0,0,0,.d,.d,,,.k,.k,.k,.k,1,0,1,0,1,0,1,.h,.h,0,0,0,1,1,0,0,0,0,1,0,0,0,0,0,0,0,0,0,0,0,0,0,0,0,0,0,0,0,0,0,0,0,0,0,0,0,.2,0,0,.h,.h,.h,.h,.h,0,0,1,.h,.h,.h,.h,.h,.h,.h,.h,.h,.h,.h,.h,.h,.h,.h,4,2,.c,.h,.h,.h,.h,.h,.h,.h,.h,.h,.h,.h,.h,.h,.h,.h,.h,.h,.h,.h,.h,.h,.h,.h,.h,.h,.h,.h,.h,.h,.h,.h,.h,.h,.h,.h,.h,4933
10002,10,10,1,2,1,1,1,3,2,2,1,1,1,1,1,0,2,1,4,2,5,1.6666666,2,1,0,0,0,0,,,1,1,0,1,0,1,1,1,0,0,0,0,1,0,0,0,.d,.d,,,.k,.k,.k,.k,1,0,1,0,1,0,1,.h,.h,0,0,0,1,0,0,0,.a,0,1,0,0,0,0,0,0,0,0,0,0,0,0,0,0,0,0,0,0,0,0,0,0,0,0,0,.x,.x,.x,.x,0,.h,.h,.h,.h,.h,.h,.h,.h,.e,.e,.e,.h,.h,.h,.h,.h,.h,.h,.h,.h,.h,.h,.h,4,2,.c,.h,.h,.h,.h,.h,.h,.h,2,.c,2,.c,.c,.c,.c,.c,.c,.c,.c,.c,.c,.c,.e,.e,.e,.e,.e,.e,.e,.e,.e,.e,.e,.e,.e,.e,.e,5009
10002,11,11,1,2,1,1,1,3,2,2,1,1,1,1,1,0,2,1,4,2,5,1,2,1,0,1,0,0,,,1,0,1,1,0,0,0,1,0,0,0,0,0,0,0,0,2,2,2,0,.k,.k,.k,.k,1,0,1,0,0,0,1,0,0,.h,.h,0,1,1,0,0,0,0,1,0,0,0,0,0,0,0,0,0,0,0,0,0,0,0,0,0,0,0,0,0,0,0,0,0,0,0,.2,.1,0,1,0,0,0,0,0,0,0,0,0,0,.h,.h,.h,.h,.h,.h,.h,.h,.h,.h,.h,.h,4,4,.c,.h,.h,.h,.h,.h,.h,.h,2,.c,2,.c,.c,.c,.c,.c,.c,.c,.c,.c,.c,.c,2,2,2,2,2,2,3,3,3,2,2,3,4,1,1,5114
10002,12,12,1,2,1,1,1,3,2,2,1,1,1,1,1,0,2,1,4,2,5,1.6666666,2,1,0,0,0,0,0,0,1,0,1,0,0,0,0,0,0,0,0,0,0,0,0,0,1,1,2,0,.k,.k,.k,.k,0,1,0,1,1,0,1,0,0,0,0,0,1,1,0,0,0,0,1,1,0,0,0,0,0,1,0,0,0,0,0,0,0,0,0,0,0,0,0,0,0,100,0,0,0,0,.30000001,0,0,.h,.h,.h,0,0,.h,.h,.h,0,0,0,.h,.h,.h,.h,.h,.h,.h,.h,.h,.h,.h,.h,4,2,.h,.c,.c,.c,.c,.c,.h,.h,2,.c,2,.c,.c,.c,.c,.c,.c,.c,.c,.c,.c,.c,1,1,1,2,1,2,1,.h,3,.h,.h,.h,.h,.h,.h,2608
10002,13,13,1,2,1,1,1,3,2,2,1,1,1,1,1,0,2,1,4,2,5,1.6666666,2,1,0,1,0,0,0,0,1,1,1,1,0,0,1,1,0,0,0,0,0,0,0,0,1,2,1,0,.k,.k,.k,.k,1,0,1,0,0,0,1,0,0,0,0,0,1,1,0,0,0,0,1,0,0,0,0,0,0,0,0,0,0,0,0,0,0,0,0,0,0,0,0,0,0,0,0,0,0,0,.30000001,0,0,1,0,0,0,1,1,0,1,.h,.h,.h,.h,.h,.h,.h,.h,.h,.h,.h,.h,.h,.h,.h,4,2,.h,.c,.c,.c,.c,.c,.h,.h,2,.c,2,.c,.c,.c,.c,.c,.c,.c,.c,.c,.c,.c,.h,.h,.h,.h,.h,.h,.h,.h,.h,.h,.h,.h,.h,.h,.h,2916
10002,14,14,1,2,1,1,1,3,2,2,1,1,1,1,1,0,2,1,4,2,5,1.6666666,2,1,0,0,0,0,0,0,1,0,0,0,0,0,1,1,0,0,0,1,0,0,0,0,2,1,1,0,.k,.k,.k,.k,1,0,1,0,0,0,1,0,1,0,0,0,1,1,0,0,0,0,1,1,0,0,1,0,0,0,0,0,0,0,0,0,0,0,0,0,0,0,0,0,0,100,0,0,0,0,.1,0,0,.h,.h,.h,0,1,.h,.h,.h,0,0,0,.h,.h,.h,.h,.h,.h,.h,.h,.h,.h,.h,.h,5,2,.h,.c,.c,.c,.c,.c,.h,.h,2,.c,2,.c,.c,.c,.c,.c,.c,.c,.c,.c,.c,.c,3,3,3,3,3,3,3,.h,3,.h,.h,.h,.h,.h,.h,3239
10002,15,15,1,2,1,1,1,3,2,2,1,1,1,1,1,0,2,1,4,2,5,.83333331,1,1,0,0,0,0,,0,1,0,0,1,0,0,1,1,0,0,0,1,0,0,0,0,1,1,1,0,.k,.k,.k,.k,1,0,1,0,0,0,1,0,1,0,0,0,0,1,0,1,0,0,1,0,0,0,0,0,0,0,0,0,0,0,0,0,0,0,0,0,0,0,0,0,0,0,0,1,0,0,.30000001,.30000001,0,0,0,0,0,1,1,0,0,.h,.h,.h,.h,.h,.h,.h,.h,.h,.h,.h,.h,.h,.h,.h,5,2,.h,.c,.c,.c,.c,.c,.h,.h,2,.c,2,.c,.c,.c,.c,.c,.c,.c,.c,.c,.c,.c,.h,.h,.h,.h,.h,.h,.h,.h,.h,.h,.h,.h,.h,.h,.h,3485
10002,17,17,1,2,1,1,1,3,2,2,1,1,1,1,1,0,2,1,4,2,5,1.6666666,2,1,0,1,0,0,0,0,1,1,0,1,0,1,1,0,0,0,0,0,0,0,0,0,1,2,0,0,.k,.k,.k,.k,1,0,1,0,1,0,1,0,0,0,0,0,1,1,0,0,0,0,1,0,0,0,0,0,0,0,0,0,0,0,0,0,0,0,0,0,0,0,0,0,0,0,0,0,0,0,.2,.5,0,1,0,0,0,0,0,0,0,.h,.h,.h,2,.c,4,.e,0,0,1,0,0,0,1,2,4,2,.h,.c,.c,.c,.c,.c,.h,.h,2,.c,2,.c,.c,.c,.c,.c,.c,.c,.c,.c,.c,.c,.h,.h,.h,.h,.h,.h,.h,.h,.h,.h,.h,.h,.h,.h,.h,3696
10002,19,19,1,2,1,1,1,3,2,2,1,1,1,1,1,0,2,1,4,2,5,1.6666666,2,1,0,0,0,0,0,0,1,1,1,1,0,0,1,0,0,0,0,0,0,0,0,0,1,1,1,0,.k,.k,.k,.k,1,0,1,0,0,0,1,0,0,0,0,0,1,1,0,0,0,0,1,1,0,0,1,0,0,0,0,0,0,0,0,0,0,0,0,0,0,0,0,0,0,100,0,0,0,0,.1,.30000001,0,1,0,0,0,0,1,0,0,.h,.h,.h,1,4,.c,.c,.c,.c,.c,.c,.c,.c,.c,.c,4,2,.h,.c,.c,.c,.c,.c,.c,.c,1,2,2,.c,.c,.c,.c,.c,.c,.c,.c,.c,.c,.c,.h,.h,.h,.h,.h,.h,.h,.h,.h,.h,.h,.h,.h,.h,.h,3883
10003,1,1,1,2,3,1,1,2,2,2,1,1,1,1,1,0,2,1,6,2,5,1.6666666,2,0,0,1,1,0,,,1,0,0,1,1,0,1,0,0,0,0,0,0,0,1,.h,.h,.h,,,.k,.k,.k,.k,1,0,1,0,1,1,0,.h,.h,.h,.h,.h,.h,.h,.h,.h,.h,.h,.h,0,0,0,0,0,0,0,0,0,,,.5,0,0,0,0,0,.5,0,0,,,0,50,1,.60000002,0,.92000002,,0,.h,.h,.h,.h,.h,.h,.h,.h,.h,.h,.h,.h,.h,.h,.h,.h,.h,.h,.h,.h,.h,.h,.h,.h,.h,.h,.h,.h,.h,.h,.h,.h,.h,.h,.h,.h,.h,.h,.h,.h,.h,.h,.h,.h,.h,.h,.h,.h,.h,.h,.h,.h,.h,.h,.h,.h,.h,.h,.h,.h,.h,.h,3614
10003,2,2,1,2,3,1,1,2,2,2,1,1,1,1,1,0,2,1,6,2,5,1.6666666,2,1,0,0,0,0,,,1,0,0,1,0,0,1,1,0,0,0,1,0,0,1,0,.d,.d,,,.k,.k,.k,.k,1,0,1,0,1,1,0,.h,.h,.h,.h,.h,1,0,1,1,1,1,.h,0,0,0,0,0,0,0,0,0,0,0,0,0,0,0,0,0,0,0,0,0,0,0,0,1,15,15,15,,0,.h,.h,.h,.h,.h,.h,.h,.h,.h,.h,.h,.h,.h,.h,.h,.h,.h,.h,.h,.h,.h,.h,.h,.h,.h,.h,.h,.h,.h,.h,.h,.h,.h,.h,.h,.h,.h,.h,.h,.h,.h,.h,.h,.h,.h,.h,.h,.h,.h,.h,.h,.h,.h,.h,.h,.h,.h,.h,.h,.h,.h,.h,4814
10003,3,3,1,2,3,1,1,2,2,2,1,1,1,1,1,0,2,1,6,2,5,1.6666666,2,1,0,0,0,0,,,1,0,0,0,0,0,1,0,0,0,0,0,0,0,0,0,.d,.d,,,.k,.k,.k,.k,1,0,1,0,1,1,0,.h,.h,.h,.h,.h,1,0,1,1,1,1,.h,0,0,0,0,0,0,0,0,0,0,0,0,0,0,0,0,0,0,0,0,0,0,0,0,1,.h,.h,.h,,0,.h,.h,.h,.h,.h,.h,.h,.h,.h,.h,.h,.h,.h,.h,.h,.h,.h,.h,.h,.h,.h,.h,.h,.h,.h,.h,.h,.h,.h,.h,.h,.h,.h,.h,.h,.h,.h,.h,.h,.h,.h,.h,.h,.h,.h,.h,.h,.h,.h,.h,.h,.h,.h,.h,.h,.h,.h,.h,.h,.h,.h,.h,4760
10003,4,4,1,2,3,1,1,2,2,2,1,1,1,1,1,0,2,1,6,2,5,1.6666666,2,1,0,0,0,0,,,1,0,0,0,0,0,1,0,0,0,0,0,0,0,0,0,.d,.d,,,.k,.k,.k,.k,1,0,1,0,1,1,0,.h,.h,.h,.h,.h,1,0,1,1,1,1,1,0,0,0,0,0,0,0,0,0,0,0,0,0,0,0,0,0,0,0,0,0,0,0,0,1,.40000001,0,.75999999,.30000001,0,.h,.h,.h,.h,.h,.h,.h,.h,1,1,0,.h,.h,.h,.h,.h,.h,.h,.h,.h,.h,.h,.h,.h,.h,.h,.h,.h,.h,.h,.h,.h,.h,.h,.h,.h,.h,.h,.h,.h,.h,.h,.h,.h,.h,.h,.h,3,4,4,3,3,3,5,3,3,1,2,2,4,1,3,4243
10003,5,5,1,2,3,1,1,2,2,2,1,1,1,1,1,0,2,1,6,2,5,1.6666666,2,1,0,0,0,0,,,1,0,0,0,0,0,1,0,0,0,0,0,0,0,0,0,.d,.d,,,.k,.k,.k,.k,1,0,1,0,1,1,0,.h,.h,.h,.h,.h,1,0,1,1,1,1,1,0,0,0,0,0,0,0,0,0,0,0,0,0,0,0,0,0,0,0,0,0,0,0,0,1,.40000001,0,.88,0,0,.h,.h,.h,.h,.h,.h,.h,.h,.h,.h,.h,.h,.h,.h,.h,.h,.h,.h,.h,.h,.h,.h,.h,.h,.h,.h,.h,.h,.h,.h,.h,.h,.h,.h,.h,.h,.h,.h,.h,.h,.h,.h,.h,.h,.h,.h,.h,.h,.h,.h,.h,.h,.h,.h,.h,.h,.h,.h,.h,.h,.h,.h,4521
10003,6,6,1,2,3,1,1,2,2,2,1,1,1,1,1,0,2,1,6,2,5,1.6666666,2,1,0,0,0,0,,,1,0,0,0,0,0,1,0,0,0,0,0,0,0,0,0,.d,.d,,,.k,.k,.k,.k,1,0,1,0,1,1,0,.h,.h,0,0,0,1,0,1,1,1,1,1,0,0,0,0,0,0,0,0,0,0,0,0,0,0,0,0,0,0,0,0,0,0,0,0,1,.h,.h,.h,.h,0,.h,.h,.h,.h,.h,.h,.h,.h,1,1,0,.h,.h,.h,.h,.h,.h,.h,.h,.h,.h,.h,.h,.h,.h,.h,.h,.h,.h,.h,.h,.h,.h,.h,.h,.h,.h,.h,.h,.h,.h,.h,.h,.h,.h,.h,.h,4,4,3,3,2,3,4,3,3,1,2,3,4,1,3,4662
10003,7,7,1,2,3,1,1,2,2,2,1,1,1,1,1,0,2,1,6,2,5,1.6666666,2,1,0,0,0,0,,,1,0,0,0,0,0,1,1,0,0,0,1,0,0,0,0,.d,.d,,,.k,.k,.k,.k,1,0,1,0,1,0,0,.h,.h,0,0,0,1,0,0,1,0,1,1,0,0,0,0,0,0,0,0,0,0,0,0,0,0,0,0,0,0,0,0,0,0,0,0,0,0,0,.30000001,0,0,.h,.h,.h,.h,.h,.h,.h,.h,.h,.h,.h,.h,.h,.h,.h,.h,.h,.h,.h,.h,.h,.h,.h,.h,.h,.h,.h,.h,.h,.h,.h,.h,.h,.h,.h,.h,.h,.h,.h,.h,.h,.h,.h,.h,.h,.h,.h,.h,.h,.h,.h,.h,.h,.h,.h,.h,.h,.h,.h,.h,.h,.h,5009
10003,8,8,1,2,3,1,1,2,2,2,1,1,1,1,1,0,2,1,6,2,5,1.6666666,2,1,0,0,0,0,,,1,0,0,0,0,0,1,0,0,0,0,0,0,0,0,0,.d,.d,,,.k,.k,.k,.k,1,0,1,0,1,1,0,.h,.h,0,0,0,1,0,0,1,1,1,1,0,0,0,0,0,0,0,0,0,0,0,0,0,0,0,0,0,0,0,0,0,0,0,0,0,0,0,.60000002,.2,0,.h,.h,.h,.h,.h,.h,.h,.h,1,1,0,.h,.h,.h,.h,.h,.h,.h,.h,.h,.h,.h,.h,1,.c,1,.h,.h,.h,.h,.h,.h,.h,.h,.h,.h,.h,.h,.h,.h,.h,.h,.h,.h,.h,.h,.h,4,4,3,2,3,3,5,3,3,1,2,2,4,2,2,4890
10003,9,9,1,2,3,1,1,2,2,2,1,1,1,1,1,0,2,1,6,2,5,1.6666666,2,1,0,0,0,0,,,1,0,0,0,0,0,1,0,0,0,0,0,0,0,0,0,.d,.d,,,.k,.k,.k,.k,1,0,1,0,1,1,0,.h,.h,0,0,0,1,0,0,0,0,0,1,0,0,0,0,0,0,0,0,0,0,0,0,0,0,0,0,0,0,0,0,0,0,0,0,0,0,0,.30000001,0,0,.h,.h,.h,.h,.h,1,1,1,.h,.h,.h,.h,.h,.h,.h,.h,.h,.h,.h,.h,.h,.h,.h,1,.c,1,.h,.h,.h,.h,.h,.h,.h,.h,.h,.h,.h,.h,.h,.h,.h,.h,.h,.h,.h,.h,.h,.h,.h,.h,.h,.h,.h,.h,.h,.h,.h,.h,.h,.h,.h,.h,4933
10003,10,10,1,2,3,1,1,2,2,2,1,1,1,1,1,0,2,1,6,2,5,1.6666666,2,1,0,0,0,0,,,1,0,0,1,0,0,1,0,0,0,0,0,0,0,0,0,.d,.d,,,.k,.k,.k,.k,1,0,1,0,1,1,0,.h,.h,0,0,0,1,1,0,0,0,0,1,1,0,0,0,0,0,0,0,0,1,0,0,0,0,0,0,0,0,0,0,0,0,100,0,0,0,0,.1,0,0,.h,.h,.h,.h,.h,.h,.h,.h,1,1,0,.h,.h,.h,.h,.h,.h,.h,.h,.h,.h,.h,.h,1,.c,1,.h,.h,.h,.h,.h,.h,.h,2,.c,2,.c,.c,.c,.c,.c,.c,.c,.c,.c,.c,.c,3,4,3,3,3,3,5,3,3,2,2,2,4,2,3,5009
10003,11,11,1,2,3,1,1,2,2,2,1,1,1,1,1,0,2,1,6,2,5,1.6666666,2,1,0,0,0,0,,,1,0,1,1,0,0,1,0,0,0,0,0,0,0,0,0,0,0,0,1,.k,.k,.k,.k,1,0,1,0,1,0,0,0,0,.h,.h,0,1,1,1,1,1,1,1,0,0,0,0,0,0,0,0,0,0,0,0,0,0,0,0,0,0,0,0,0,0,0,0,0,0,0,.69999999,0,0,1,0,0,1,0,1,1,1,0,1,0,.h,.h,.h,.h,.h,.h,.h,.h,.h,.h,.h,.h,1,.c,1,.h,.h,.h,.h,.h,.h,.h,2,.c,2,.c,.c,.c,.c,.c,.c,.c,.c,.c,.c,.c,3,3,3,3,3,3,4,3,3,1,2,3,4,2,2,5114
10003,12,12,1,2,3,1,1,2,2,2,1,1,1,1,1,0,2,1,6,2,5,1.6666666,2,1,0,0,0,0,0,0,1,0,0,0,0,0,1,0,0,0,0,0,0,0,0,0,0,0,0,1,.k,.k,.k,.k,1,0,1,0,1,1,0,0,0,0,0,0,1,1,1,1,1,1,1,0,0,0,0,0,0,0,0,0,0,0,0,0,0,0,0,0,0,0,0,0,0,0,0,1,0,0,.40000001,0,0,.h,.h,.h,0,1,.h,.h,.h,0,1,0,.h,.h,.h,.h,.h,.h,.h,.h,.h,.h,.h,.h,1,.c,.h,1,0,0,0,0,.h,.h,2,.c,2,.c,.c,.c,.c,.c,.c,.c,.c,.c,.c,.c,3,3,3,2,2,2,4,.h,3,.h,.h,.h,.h,.h,.h,2608
10003,13,13,1,2,3,1,1,2,2,2,1,1,1,1,1,0,2,1,6,2,5,1.6666666,2,1,0,0,0,0,0,0,1,1,1,1,0,0,1,1,0,0,0,1,0,0,0,0,0,0,1,0,.k,.k,.k,.k,1,0,1,0,1,1,0,0,0,0,0,0,1,1,1,1,1,1,1,0,0,0,0,0,0,0,0,0,0,0,0,0,0,0,0,0,0,0,0,0,0,0,0,1,,,,,0,1,0,0,0,1,1,1,1,.h,.h,.h,.h,.h,.h,.h,.h,.h,.h,.h,.h,.h,.h,.h,1,.c,.h,1,0,0,0,0,.h,.h,2,.c,2,.c,.c,.c,.c,.c,.c,.c,.c,.c,.c,.c,.h,.h,.h,.h,.h,.h,.h,.h,.h,.h,.h,.h,.h,.h,.h,2916
10003,14,14,1,2,3,1,1,2,2,2,1,1,1,1,1,0,2,1,6,2,5,1.6666666,2,1,0,0,0,0,0,0,1,0,1,0,0,0,1,0,0,0,0,1,0,0,0,0,0,0,0,1,.k,.k,.k,.k,1,0,1,0,1,0,1,0,0,0,0,0,1,1,1,1,1,1,1,0,0,0,0,0,0,0,0,0,0,0,0,0,0,0,0,0,0,0,0,0,0,0,0,1,0,0,0,0,0,.h,.h,.h,0,1,.h,.h,.h,0,1,0,.h,.h,.h,.h,.h,.h,.h,.h,.h,.h,.h,.h,1,.c,.h,1,0,0,0,0,.h,.h,2,.c,2,.c,.c,.c,.c,.c,.c,.c,.c,.c,.c,.c,3,3,3,2,2,2,4,.h,3,.h,.h,.h,.h,.h,.h,3239
10003,17,17,1,2,3,1,1,2,2,2,1,1,1,1,1,0,2,1,6,2,5,1.6666666,2,1,0,0,0,0,0,0,1,0,1,1,0,0,1,0,0,0,0,0,0,0,0,0,2,1,1,0,.k,.k,.k,.k,1,0,1,0,1,0,0,0,0,0,0,0,1,1,0,0,0,0,1,0,0,0,0,0,0,0,0,0,0,0,0,0,0,0,0,0,0,0,0,0,0,0,0,0,0,0,.30000001,0,0,1,0,0,0,0,1,1,1,.h,.h,.h,2,.c,1,.d,.d,.d,.d,.d,.d,.d,.d,.d,1,.c,.h,1,0,0,0,0,.h,.h,2,.c,2,.c,.c,.c,.c,.c,.c,.c,.c,.c,.c,.c,.h,.h,.h,.h,.h,.h,.h,.h,.h,.h,.h,.h,.h,.h,.h,3696
10003,19,19,1,2,3,1,1,2,2,2,1,1,1,1,1,0,2,1,6,2,5,1.6666666,2,1,0,0,0,0,0,0,1,0,0,1,0,0,1,0,0,0,0,1,0,0,0,0,0,0,2,0,.k,.k,.k,.k,1,0,1,0,1,0,0,0,0,0,0,0,0,1,0,0,0,0,1,0,0,0,0,0,0,0,0,0,0,0,0,0,0,0,0,0,0,0,0,0,0,0,0,0,0,0,.2,0,0,1,0,0,0,0,1,0,1,.h,.h,.h,1,1,.c,.c,.c,.c,.c,.c,.c,.c,.c,.c,1,.c,.h,1,0,0,0,0,0,.c,2,.c,2,.c,.c,.c,.c,.c,.c,.c,.c,.c,.c,.c,.h,.h,.h,.h,.h,.h,.h,.h,.h,.h,.h,.h,.h,.h,.h,3883
10004,1,1,1,1,5,1,1,2,3,2,1,1,1,2,2,.c,1,.c,,.c,5,2.5,3,1,0,0,0,0,,,1,0,0,0,0,0,0,0,0,0,0,0,0,0,0,.h,.h,.h,,,.h,.h,,,1,0,1,0,0,0,0,.h,.h,.h,.h,.h,.h,.h,.h,.h,.h,.h,.h,0,0,0,0,0,0,0,0,0,,,.5,0,0,0,0,0,.5,0,0,,,0,50,.c,.c,.c,.c,,.c,.h,.h,.h,.h,.h,.h,.h,.h,.h,.h,.h,.h,.h,.h,.h,.h,.h,.h,.h,.h,.h,.h,.h,.h,.h,.h,.h,.h,.h,.h,.h,.h,.h,.h,.h,.h,.h,.h,.h,.h,.h,.h,.h,.h,.h,.h,.h,.h,.h,.h,.h,.h,.h,.h,.h,.h,.h,.h,.h,.h,.h,.h,5011
10004,2,2,1,1,5,1,1,2,3,2,1,1,1,2,2,.c,1,.c,,.c,5,2.5,3,1,0,0,0,0,,,1,0,0,0,0,0,0,0,0,0,0,0,0,0,0,0,0,2,2,0,0,2,2,0,1,0,1,0,1,0,0,.h,.h,.h,.h,.h,1,0,1,0,1,1,.h,0,0,0,0,0,0,0,0,0,0,0,1,0,0,0,0,0,1,0,0,0,0,0,100,.c,.c,.c,.c,,.c,.h,.h,.h,.h,.h,.h,.h,.h,.h,.h,.h,.h,.h,.h,.h,.h,.h,.h,.h,.h,.h,.h,.h,.h,.h,.h,.h,.h,.h,.h,.h,.h,.h,.h,.h,.h,.h,.h,.h,.h,.h,.h,.h,.h,.h,.h,.h,.h,.h,.h,.h,.h,.h,.h,.h,.h,.h,.h,.h,.h,.h,.h,6334
10004,3,3,1,1,5,1,1,2,3,2,1,1,1,2,2,.c,1,.c,,.c,5,2.5,3,1,0,0,0,0,,,1,0,0,0,0,0,0,0,0,0,0,0,0,0,0,0,0,2,2,0,0,2,2,0,1,0,1,0,0,0,0,.h,.h,.h,.h,.h,1,0,1,0,0,0,.h,0,0,0,0,0,0,0,0,0,0,0,0,0,0,0,0,0,0,0,0,0,0,0,0,.c,.h,.h,.h,,.c,.h,.h,.h,.h,.h,.h,.h,.h,.h,.h,.h,.h,.h,.h,.h,.h,.h,.h,.h,.h,.h,.h,.h,.h,.h,.h,.h,.h,.h,.h,.h,.h,.h,.h,.h,.h,.h,.h,.h,.h,.h,.h,.h,.h,.h,.h,.h,.h,.h,.h,.h,.h,.h,.h,.h,.h,.h,.h,.h,.h,.h,.h,6885
10004,4,4,1,1,5,1,1,2,3,2,1,1,1,2,2,.c,1,.c,,.c,5,2.5,3,1,0,0,0,0,,,1,0,0,0,0,1,0,0,0,0,0,0,0,0,0,0,0,2,1,0,0,2,1,0,1,0,1,0,0,0,0,.h,.h,.h,.h,.h,1,0,1,1,1,1,1,0,0,0,0,0,0,0,0,0,0,0,1,0,0,0,0,0,0,0,0,1,0,0,100,.c,.c,.c,.c,.c,.c,.h,.h,.h,.h,.h,.h,.h,.h,1,1,1,.h,.h,.h,.h,.h,.h,.h,.h,.h,.h,.h,.h,.h,.h,.h,.h,.h,.h,.h,.h,.h,.h,.h,.h,.h,.h,.h,.h,.h,.h,.h,.h,.h,.h,.h,.h,4,4,4,3,3,1,5,1,4,4,4,4,2,1,1,5462
10004,5,5,1,1,5,1,1,2,3,2,1,1,1,2,2,.c,1,.c,,.c,5,2.5,3,1,0,0,0,0,,,1,0,0,0,0,0,0,0,0,0,0,0,0,0,0,0,1,2,2,0,1,2,2,0,1,0,1,0,0,0,0,.h,.h,.h,.h,.h,1,0,1,0,0,0,1,0,0,0,0,0,0,0,0,0,0,0,1,0,1,0,0,0,1,0,0,0,0,0,200,.c,.c,.c,.c,.c,.c,.h,.h,.h,.h,.h,.h,.h,.h,.h,.h,.h,.h,.h,.h,.h,.h,.h,.h,.h,.h,.h,.h,.h,.h,.h,.h,.h,.h,.h,.h,.h,.h,.h,.h,.h,.h,.h,.h,.h,.h,.h,.h,.h,.h,.h,.h,.h,.h,.h,.h,.h,.h,.h,.h,.h,.h,.h,.h,.h,.h,.h,.h,5592
10004,6,6,1,1,5,1,1,2,3,2,1,1,1,2,2,.c,1,.c,,.c,5,2.5,3,1,0,0,0,0,,,1,0,0,0,0,0,0,0,0,0,0,0,0,0,0,0,1,2,2,0,1,2,2,0,1,0,1,0,0,0,1,.h,.h,0,0,0,1,0,0,0,0,0,1,1,0,1,0,0,0,1,0,0,0,0,0,0,0,0,0,0,0,0,0,0,0,200,0,.c,.h,.h,.h,.h,.c,.h,.h,.h,.h,.h,.h,.h,.h,1,1,1,.h,.h,.h,.h,.h,.h,.h,.h,.h,.h,.h,.h,.h,.h,.h,.h,.h,.h,.h,.h,.h,.h,.h,.h,.h,.h,.h,.h,.h,.h,.h,.h,.h,.h,.h,.h,4,4,3,2,2,1,5,3,5,4,4,1,1,1,1,5788
10004,7,7,1,1,5,1,1,2,3,2,1,1,1,2,2,.c,1,.c,,.c,5,2.5,3,1,0,0,0,0,,,1,0,0,0,0,0,0,0,0,0,0,0,0,0,0,0,3,2,4,0,3,2,4,0,1,0,1,0,1,0,1,.h,.h,0,0,0,1,0,0,1,0,0,1,1,0,0,0,0,0,1,0,0,0,0,0,0,0,0,0,0,0,0,0,0,0,100,0,.c,.c,.c,.c,.c,.c,.h,.h,.h,.h,.h,.h,.h,.h,.h,.h,.h,.h,.h,.h,.h,.h,.h,.h,.h,.h,.h,.h,.h,.h,.h,.h,.h,.h,.h,.h,.h,.h,.h,.h,.h,.h,.h,.h,.h,.h,.h,.h,.h,.h,.h,.h,.h,.h,.h,.h,.h,.h,.h,.h,.h,.h,.h,.h,.h,.h,.h,.h,6073